Reaction Details
TargetThioredoxin reductase 1, cytoplasmic
LigandBDBM50385302
Substrate/Competitorn/a
Meas. Tech.ChEMBL_822563 (CHEMBL2039583)
IC50 780±n/a nM
Citation He, JLi, DXiong, KGe, YJin, HZhang, GHong, MTian, YYin, JZeng, H Inhibition of thioredoxin reductase by a novel series of bis-1,2-benzisoselenazol-3(2H)-ones: Organoselenium compounds for cancer therapy. Bioorg Med Chem20:3816-27 (2012) 
 
Thioredoxin reductase 1, cytoplasmic
Name:Thioredoxin reductase 1, cytoplasmic
Type:PROTEIN
Mol. Mass.:54519.34
Organism:Rattus norvegicus
Description:ChEMBL_589950
Residue:498
BDBM50385302
NameBDBM50385302
Synonyms:CHEMBL2035461 | US8592468, EbSe15
TypeSmall organic molecule
Emp. Form.C17H14N2O2Se2
Mol. Mass.436.23
SMILESO=c1n(CCCn2[se]c3ccccc3c2=O)[se]c2ccccc12