Reaction Details
TargetArachidonate 5-lipoxygenase-activating protein
LigandBDBM22334
Substrate/Competitorn/a
Meas. Tech.ChEMBL_822749 (CHEMBL2040233)
IC50 110±n/a nM
Citation Banoglu, EÇaliskan, BLuderer, SEren, GÖzkan, YAltenhofen, WWeinigel, CBarz, DGerstmeier, JPergola, CWerz, O Identification of novel benzimidazole derivatives as inhibitors of leukotriene biosynthesis by virtual screening targeting 5-lipoxygenase-activating protein (FLAP). Bioorg Med Chem20:3728-41 (2012) 
 
Arachidonate 5-lipoxygenase-activating protein
Name:Arachidonate 5-lipoxygenase-activating protein
Type:Enzyme
Mol. Mass.:18159.90
Organism:Homo sapiens (Human)
Description:P20292
Residue:161
BDBM22334
NameBDBM22334
Synonyms:BW A4C BWA4C CHEMBL314360 N-(3-phenoxycinnamyl)acetohydroxamic acid | N-hydroxy-N-[(2E)-3-(3-phenoxyphenyl)prop-2-en-1-yl]acetamide
TypeSmall organic molecule
Emp. Form.C17H17NO3
Mol. Mass.283.3218
SMILESCC(=O)N(O)C\C=C\c1cccc(Oc2ccccc2)c1