Reaction Details
TargetDiacylglycerol O-acyltransferase 1
LigandBDBM50385412
Substrate/Competitorn/a
Meas. Tech.ChEMBL_822962 (CHEMBL2038283)
IC50 6.7±n/a nM
Citation McCoull, WAddie, MSBirch, AMBirtles, SBuckett, LKButlin, RJBowker, SSBoyd, SChapman, SDavies, RDDonald, CSGreen, CPJenner, CKemmitt, PDLeach, AGMoody, GCGutierrez, PMNewcombe, NJNowak, TPacker, MJPlowright, ATRevill, JSchofield, PSheldon, CStokes, STurnbull, AVWang, SJWhalley, DPWood, JM Identification, optimisation and in vivo evaluation of oxadiazole DGAT-1 inhibitors for the treatment of obesity and diabetes. Bioorg Med Chem Lett22:3873-8 (2012) 
 
Diacylglycerol O-acyltransferase 1
Name:Diacylglycerol O-acyltransferase 1
Type:Protein
Mol. Mass.:55297.82
Organism:Homo sapiens (Human)
Description:O75907
Residue:488
BDBM50385412
NameBDBM50385412
Synonyms:CHEMBL2036583
TypeSmall organic molecule
Emp. Form.C20H14FN5O3
Mol. Mass.391.3553
SMILESFc1ccccc1Nc1nnc(o1)C(=O)Nc1ccc(Oc2ccccc2)nc1