Reaction Details
TargetDiacylglycerol O-acyltransferase 1
LigandBDBM50385428
Substrate/Competitorn/a
Meas. Tech.ChEMBL_822962 (CHEMBL2038283)
IC50 170±n/a nM
Citation McCoull, WAddie, MSBirch, AMBirtles, SBuckett, LKButlin, RJBowker, SSBoyd, SChapman, SDavies, RDDonald, CSGreen, CPJenner, CKemmitt, PDLeach, AGMoody, GCGutierrez, PMNewcombe, NJNowak, TPacker, MJPlowright, ATRevill, JSchofield, PSheldon, CStokes, STurnbull, AVWang, SJWhalley, DPWood, JM Identification, optimisation and in vivo evaluation of oxadiazole DGAT-1 inhibitors for the treatment of obesity and diabetes. Bioorg Med Chem Lett22:3873-8 (2012) 
 
Diacylglycerol O-acyltransferase 1
Name:Diacylglycerol O-acyltransferase 1
Type:Protein
Mol. Mass.:55297.82
Organism:Homo sapiens (Human)
Description:O75907
Residue:488
BDBM50385428
NameBDBM50385428
Synonyms:CHEMBL2036733
TypeSmall organic molecule
Emp. Form.C19H20N6O3
Mol. Mass.380.4005
SMILESCc1cccc(Nc2nnc(o2)C(=O)Nc2ccc(nc2)N2CCOCC2)c1