Reaction Details
TargetC-C chemokine receptor type 2
LigandBDBM50385450
Substrate/Competitorn/a
Meas. Tech.ChEMBL_823112 (CHEMBL2039634)
Kd 3.47±n/a nM
Citation Cumming, JGBower, JFWaterson, DFaull, APoyser, PJTurner, PMcDermott, BCampbell, ADHudson, JJames, MWinter, JWood, C The design and synthesis of novel, potent and orally bioavailable N-aryl piperazine-1-carboxamide CCR2 antagonists with very high hERG selectivity. Bioorg Med Chem Lett22:3895-9 (2012) 
 
C-C chemokine receptor type 2
Name:C-C chemokine receptor type 2
Type:Enzyme
Mol. Mass.:41932.32
Organism:Homo sapiens (Human)
Description:P41597
Residue:374
BDBM50385450
NameBDBM50385450
Synonyms:CHEMBL2036782
TypeSmall organic molecule
Emp. Form.C19H27Cl2N5O2
Mol. Mass.428.356
SMILESCC(C)N1CCN[C@H](C1)C(=O)N1CCN(CC1)C(=O)Nc1ccc(Cl)c(Cl)c1