Reaction Details
TargetPolymerase acidic protein
LigandBDBM50152559
Substrate/Competitorn/a
Meas. Tech.ChEMBL_823233 (CHEMBL2040651)
Ki 960±n/a nM
Citation Baughman, BMJake Slavish, PDuBois, RMBoyd, VAWhite, SWWebb, TR Identification of influenza endonuclease inhibitors using a novel fluorescence polarization assay. ACS Chem Biol7:526-34 (2012) 
 
Polymerase acidic protein
Name:Polymerase acidic protein
Type:PROTEIN
Mol. Mass.:82573.84
Organism:Hepatitis C virus
Description:ChEMBL_64976
Residue:716
BDBM50152559
NameBDBM50152559
Synonyms:4-Biphenyl-4-yl-2,4-dioxo-butyric acid CHEMBL274003
TypeSmall organic molecule
Emp. Form.C16H12O4
Mol. Mass.268.2641
SMILESOC(=O)C(=O)CC(=O)c1ccc(cc1)-c1ccccc1