Reaction Details
TargetPolymerase acidic protein
LigandBDBM50258085
Substrate/Competitorn/a
Meas. Tech.ChEMBL_823233 (CHEMBL2040651)
Ki 1990±n/a nM
Citation Baughman, BMJake Slavish, PDuBois, RMBoyd, VAWhite, SWWebb, TR Identification of influenza endonuclease inhibitors using a novel fluorescence polarization assay. ACS Chem Biol7:526-34 (2012) 
 
Polymerase acidic protein
Name:Polymerase acidic protein
Type:PROTEIN
Mol. Mass.:82573.84
Organism:Hepatitis C virus
Description:ChEMBL_64976
Residue:716
BDBM50258085
NameBDBM50258085
Synonyms:4-(4-(benzyloxy)phenyl)-2-hydroxy-4-oxobut-2-enoic acid | CHEMBL492768
TypeSmall organic molecule
Emp. Form.C17H14O5
Mol. Mass.298.2901
SMILESOC(=O)C(=O)CC(=O)c1ccc(OCc2ccccc2)cc1