Reaction Details
TargetPolymerase acidic protein
LigandBDBM50385503
Substrate/Competitorn/a
Meas. Tech.ChEMBL_823233 (CHEMBL2040651)
Ki 84±n/a nM
Citation Baughman, BMJake Slavish, PDuBois, RMBoyd, VAWhite, SWWebb, TR Identification of influenza endonuclease inhibitors using a novel fluorescence polarization assay. ACS Chem Biol7:526-34 (2012) 
 
Polymerase acidic protein
Name:Polymerase acidic protein
Type:PROTEIN
Mol. Mass.:82573.84
Organism:Hepatitis C virus
Description:ChEMBL_64976
Residue:716
BDBM50385503
NameBDBM50385503
Synonyms:CHEMBL2040554
TypeSmall organic molecule
Emp. Form.C23H30ClNO4
Mol. Mass.419.942
SMILESOC(=O)C(=O)CC(=O)C1(Cc2ccc(Cl)cc2)CCN(CC2CCCCC2)CC1