Reaction Details
TargetPolymerase acidic protein
LigandBDBM50152575
Substrate/Competitorn/a
Meas. Tech.ChEMBL_823233 (CHEMBL2040651)
Ki 2000±n/a nM
Citation Baughman, BMJake Slavish, PDuBois, RMBoyd, VAWhite, SWWebb, TR Identification of influenza endonuclease inhibitors using a novel fluorescence polarization assay. ACS Chem Biol7:526-34 (2012) 
 
Polymerase acidic protein
Name:Polymerase acidic protein
Type:PROTEIN
Mol. Mass.:82573.84
Organism:Hepatitis C virus
Description:ChEMBL_64976
Residue:716
BDBM50152575
NameBDBM50152575
Synonyms:2,4-Dioxo-4-o-tolyl-butyric acid CHEMBL185898 | Sacchettini_1
TypeSmall organic molecule
Emp. Form.C11H10O4
Mol. Mass.206.1947
SMILESCc1ccccc1C(=O)CC(=O)C(O)=O