Reaction Details
TargetPolymerase acidic protein
LigandBDBM50385506
Substrate/Competitorn/a
Meas. Tech.ChEMBL_823233 (CHEMBL2040651)
Ki 21600±n/a nM
Citation Baughman, BMJake Slavish, PDuBois, RMBoyd, VAWhite, SWWebb, TR Identification of influenza endonuclease inhibitors using a novel fluorescence polarization assay. ACS Chem Biol7:526-34 (2012) 
 
Polymerase acidic protein
Name:Polymerase acidic protein
Type:PROTEIN
Mol. Mass.:82573.84
Organism:Hepatitis C virus
Description:ChEMBL_64976
Residue:716
BDBM50385506
NameBDBM50385506
Synonyms:CHEMBL2040561
TypeSmall organic molecule
Emp. Form.C11H7N3O4
Mol. Mass.245.191
SMILESOC(=O)c1nc2-c3ncccc3Cn2c(=O)c1O