Reaction Details
TargetPolymerase acidic protein
LigandBDBM50385507
Substrate/Competitorn/a
Meas. Tech.ChEMBL_823233 (CHEMBL2040651)
Ki 18700±n/a nM
Citation Baughman, BMJake Slavish, PDuBois, RMBoyd, VAWhite, SWWebb, TR Identification of influenza endonuclease inhibitors using a novel fluorescence polarization assay. ACS Chem Biol7:526-34 (2012) 
 
Polymerase acidic protein
Name:Polymerase acidic protein
Type:PROTEIN
Mol. Mass.:82573.84
Organism:Hepatitis C virus
Description:ChEMBL_64976
Residue:716
BDBM50385507
NameBDBM50385507
Synonyms:CHEMBL2040562
TypeSmall organic molecule
Emp. Form.C13H11N3O5
Mol. Mass.289.2435
SMILESCC(=O)Nc1cccc(c1)-c1nc(C(O)=O)c(O)c(=O)[nH]1