Reaction Details
TargetPolymerase acidic protein
LigandBDBM50385517
Substrate/Competitorn/a
Meas. Tech.ChEMBL_823233 (CHEMBL2040651)
Ki 70500±n/a nM
Citation Baughman, BMJake Slavish, PDuBois, RMBoyd, VAWhite, SWWebb, TR Identification of influenza endonuclease inhibitors using a novel fluorescence polarization assay. ACS Chem Biol7:526-34 (2012) 
 
Polymerase acidic protein
Name:Polymerase acidic protein
Type:PROTEIN
Mol. Mass.:82573.84
Organism:Hepatitis C virus
Description:ChEMBL_64976
Residue:716
BDBM50385517
NameBDBM50385517
Synonyms:CHEMBL2040571
TypeSmall organic molecule
Emp. Form.C14H17N5O3
Mol. Mass.303.3165
SMILESCCC(C)CNC(=O)c1nc([nH]c(=O)c1O)-c1cnccn1