Reaction Details
TargetPolymerase acidic protein
LigandBDBM50385488
Substrate/Competitorn/a
Meas. Tech.ChEMBL_823233 (CHEMBL2040651)
Ki 720±n/a nM
Citation Baughman, BMJake Slavish, PDuBois, RMBoyd, VAWhite, SWWebb, TR Identification of influenza endonuclease inhibitors using a novel fluorescence polarization assay. ACS Chem Biol7:526-34 (2012) 
 
Polymerase acidic protein
Name:Polymerase acidic protein
Type:PROTEIN
Mol. Mass.:82573.84
Organism:Hepatitis C virus
Description:ChEMBL_64976
Residue:716
BDBM50385488
NameBDBM50385488
Synonyms:CHEMBL2040578
TypeSmall organic molecule
Emp. Form.C17H15N5O3
Mol. Mass.337.3327
SMILESCC(NC(=O)c1nc([nH]c(=O)c1O)-c1cnccn1)c1ccccc1