Reaction Details
TargetPolymerase acidic protein
LigandBDBM50385494
Substrate/Competitorn/a
Meas. Tech.ChEMBL_823233 (CHEMBL2040651)
Ki 1000±n/a nM
Citation Baughman, BMJake Slavish, PDuBois, RMBoyd, VAWhite, SWWebb, TR Identification of influenza endonuclease inhibitors using a novel fluorescence polarization assay. ACS Chem Biol7:526-34 (2012) 
 
Polymerase acidic protein
Name:Polymerase acidic protein
Type:PROTEIN
Mol. Mass.:82573.84
Organism:Hepatitis C virus
Description:ChEMBL_64976
Residue:716
BDBM50385494
NameBDBM50385494
Synonyms:CHEMBL2040584
TypeSmall organic molecule
Emp. Form.C17H15N5O4
Mol. Mass.353.3321
SMILESOC[C@@H](NC(=O)c1nc([nH]c(=O)c1O)-c1cnccn1)c1ccccc1