Reaction Details
TargetPolymerase acidic protein
LigandBDBM50385503
Substrate/Competitorn/a
Meas. Tech.ChEMBL_823236 (CHEMBL2040654)
IC50 320±n/a nM
Citation Hastings, JCSelnick, HWolanski, BTomassini, JE Anti-influenza virus activities of 4-substituted 2,4-dioxobutanoic acid inhibitors. Antimicrob Agents Chemother40:1304-7 (1996) Polymerase acidic protein
Name:Polymerase acidic protein
Type:PROTEIN
Mol. Mass.:82573.84
Organism:Hepatitis C virus
Description:ChEMBL_64976
Residue:716
BDBM50385503
NameBDBM50385503
Synonyms:CHEMBL2040554
TypeSmall organic molecule
Emp. Form.C23H30ClNO4
Mol. Mass.419.942
SMILESOC(=O)C(=O)CC(=O)C1(Cc2ccc(Cl)cc2)CCN(CC2CCCCC2)CC1