Reaction Details
TargetPolymerase acidic protein
LigandBDBM50125822
Substrate/Competitorn/a
Meas. Tech.ChEMBL_823246 (CHEMBL2040664)
IC50 5100±n/a nM
Citation Singh, SBTomassini, JE Synthesis of natural flutimide and analogous fully substituted pyrazine-2,6-diones, endonuclease inhibitors of influenza virus. J Org Chem66:5504-16 (2001) Polymerase acidic protein
Name:Polymerase acidic protein
Type:PROTEIN
Mol. Mass.:82573.84
Organism:Hepatitis C virus
Description:ChEMBL_64976
Residue:716
BDBM50125822
NameBDBM50125822
Synonyms:1-Hydroxy-5-isobutyl-3-isobutylidene-3H-pyrazine-2,6-dione CHEMBL16320
TypeSmall organic molecule
Emp. Form.C12H18N2O3
Mol. Mass.238.2829
SMILESCC(C)C=c1[nH]c(=CC(C)C)c(=O)n(O)c1=O