Reaction Details
TargetPolymerase acidic protein
LigandBDBM50385531
Substrate/Competitorn/a
Meas. Tech.ChEMBL_823246 (CHEMBL2040664)
IC50 800±n/a nM
Citation Singh, SBTomassini, JE Synthesis of natural flutimide and analogous fully substituted pyrazine-2,6-diones, endonuclease inhibitors of influenza virus. J Org Chem66:5504-16 (2001) Polymerase acidic protein
Name:Polymerase acidic protein
Type:PROTEIN
Mol. Mass.:82573.84
Organism:Hepatitis C virus
Description:ChEMBL_64976
Residue:716
BDBM50385531
NameBDBM50385531
Synonyms:CHEMBL2040602
TypeSmall organic molecule
Emp. Form.C16H18N2O4
Mol. Mass.302.3251
SMILESCOc1ccc(C=c2[nH]c(=CC(C)C)c(=O)n(O)c2=O)cc1