Reaction Details
TargetPolymerase acidic protein
LigandBDBM50385536
Substrate/Competitorn/a
Meas. Tech.ChEMBL_823246 (CHEMBL2040664)
IC50 6500±n/a nM
Citation Singh, SBTomassini, JE Synthesis of natural flutimide and analogous fully substituted pyrazine-2,6-diones, endonuclease inhibitors of influenza virus. J Org Chem66:5504-16 (2001) Polymerase acidic protein
Name:Polymerase acidic protein
Type:PROTEIN
Mol. Mass.:82573.84
Organism:Hepatitis C virus
Description:ChEMBL_64976
Residue:716
BDBM50385536
NameBDBM50385536
Synonyms:CHEMBL2040608
TypeSmall organic molecule
Emp. Form.C18H13FN2O3
Mol. Mass.324.3058
SMILESOn1c(=O)c(=Cc2ccccc2)[nH]c(=Cc2ccc(F)cc2)c1=O