Reaction Details
TargetPolymerase acidic protein
LigandBDBM50385568
Substrate/Competitorn/a
Meas. Tech.ChEMBL_823247 (CHEMBL2040665)
IC50 190±n/a nM
Citation Tomassini, JSelnick, HDavies, MEArmstrong, MEBaldwin, JBourgeois, MHastings, JHazuda, DLewis, JMcClements, W Inhibition of cap (m7GpppXm)-dependent endonuclease of influenza virus by 4-substituted 2,4-dioxobutanoic acid compounds. Antimicrob Agents Chemother38:2827-37 (1995) Polymerase acidic protein
Name:Polymerase acidic protein
Type:PROTEIN
Mol. Mass.:82573.84
Organism:Hepatitis C virus
Description:ChEMBL_64976
Residue:716
BDBM50385568
NameBDBM50385568
Synonyms:CHEMBL2040640
TypeSmall organic molecule
Emp. Form.C23H24ClNO6S
Mol. Mass.477.958
SMILESOC(=O)C(=O)CC(=O)C1(Cc2ccc(Cl)cc2)CCCN(C1)S(=O)(=O)Cc1ccccc1