Reaction Details
TargetAMP deaminase 3
LigandBDBM50096165
Substrate/Competitorn/a
Meas. Tech.ChEMBL_825833 (CHEMBL2044562)
Ki 15±n/a nM
Citation Lindell, SDMaechling, SSabina, RL Synthesis and Biochemical Testing of 3-(Carboxyphenylethyl)imidazo[2,1-f][1,2,4]triazines as Inhibitors of AMP Deaminase. ACS Med Chem Lett1:286-289 (2010) 
 
AMP deaminase 3
Name:AMP deaminase 3
Type:Protein
Mol. Mass.:88818.80
Organism:Homo sapiens (Human)
Description:n/a
Residue:767
BDBM50096165
NameBDBM50096165
Synonyms:4-[2-(8-Hydroxy-7,8-dihydro-6H-imidazo[4,5-d][1,3]diazepin-3-yl)-ethyl]-5,6,7,8-tetrahydro-naphthalene-2-carboxylic acid | CHEMBL157949
TypeSmall organic molecule
Emp. Form.C19H22N4O3
Mol. Mass.354.403
SMILESOC1CNC=Nc2c1ncn2CCc1cc(cc2CCCCc12)C(O)=O