Reaction Details
TargetAdenosine receptor A3
LigandBDBM50385632
Substrate/Competitorn/a
Meas. Tech.ChEMBL_823419 (CHEMBL2046087)
Ki>1000±n/a nM
Citation El-Tayeb, AMichael, SAbdelrahman, ABehrenswerth, AGollos, SNieber, KMüller, CE Development of Polar Adenosine A2A Receptor Agonists for Inflammatory Bowel Disease: Synergism with A2B Antagonists. ACS Med Chem Lett2:890-895 (2011) 
 
Adenosine receptor A3
Name:Adenosine receptor A3
Type:G Protein-Coupled Receptor (GPCR)
Mol. Mass.:36197.32
Organism:Homo sapiens (Human)
Description:P0DMS8
Residue:318
BDBM50385632
NameBDBM50385632
Synonyms:CHEMBL2043427
TypeSmall organic molecule
Emp. Form.C19H21N5O6S
Mol. Mass.447.465
SMILESNc1nc(SCCc2ccc(cc2)C(O)=O)nc2n(cnc12)[C@@H]1O[C@H](CO)[C@@H](O)[C@H]1O