Reaction Details
TargetAdenosine receptor A2a
LigandBDBM50364063
Substrate/Competitorn/a
Meas. Tech.ChEMBL_823416 (CHEMBL2046084)
Ki 0.5±n/a nM
Citation El-Tayeb, AMichael, SAbdelrahman, ABehrenswerth, AGollos, SNieber, KMüller, CE Development of Polar Adenosine A2A Receptor Agonists for Inflammatory Bowel Disease: Synergism with A2B Antagonists. ACS Med Chem Lett2:890-895 (2011) 
 
Adenosine receptor A2a
Name:Adenosine receptor A2a
Type:G Protein-Coupled Receptor (GPCR)
Mol. Mass.:44716.46
Organism:Homo sapiens (Human)
Description:P29274
Residue:412
BDBM50364063
NameBDBM50364063
Synonyms:CHEMBL1950649
TypeSmall organic molecule
Emp. Form.C23H30N6O6
Mol. Mass.486.5209
SMILESCCNC(=O)[C@H]1O[C@H]([C@H](O)[C@@H]1O)n1cnc2c(N)nc(nc12)C#CC[C@H]1CC[C@@H](CC1)C(=O)OC