Reaction Details
TargetSmoothened homolog
LigandBDBM50385645
Substrate/Competitorn/a
Meas. Tech.ChEMBL_825977 (CHEMBL2045142)
IC50 191±n/a nM
Citation Munchhof, MJLi, QShavnya, ABorzillo, GVBoyden, TLJones, CSLaGreca, SDMartinez-Alsina, LPatel, NPelletier, KReiter, LARobbins, MDTkalcevic, GT Discovery of PF-04449913, a Potent and Orally Bioavailable Inhibitor of Smoothened. ACS Med Chem Lett3:106-111 (2012) 
 
Smoothened homolog
Name:Smoothened homolog
Type:PROTEIN
Mol. Mass.:87472.73
Organism:Mus musculus
Description:ChEMBL_1510377
Residue:793
BDBM50385645
NameBDBM50385645
Synonyms:CHEMBL2043439
TypeSmall organic molecule
Emp. Form.C19H22N6O
Mol. Mass.350.4176
SMILESCN1CC[C@H](C[C@@H]1c1nc2ccccc2[nH]1)NC(=O)Nc1cccnc1