Reaction Details
TargetTransient receptor potential cation channel subfamily V member 1
LigandBDBM50385656
Substrate/Competitorn/a
Meas. Tech.ChEMBL_826071 (CHEMBL2045502)
Ki 89±n/a nM
Citation Kim, YSKil, MJKang, SURyu, HKim, MSCho, YBhondwe, RSThorat, SASun, WLiu, KLee, JHChoi, SPearce, LVPavlyukovets, VAMorgan, MATran, RLazar, JBlumberg, PMLee, J N-4-t-Butylbenzyl 2-(4-methylsulfonylaminophenyl) propanamide TRPV1 antagonists: Structure-activity relationships in the A-region. Bioorg Med Chem20:215-24 (2011) 
 
Transient receptor potential cation channel subfamily V member 1
Name:Transient receptor potential cation channel subfamily V member 1
Type:Protein
Mol. Mass.:94960.75
Organism:Homo sapiens (Human)
Description:Q8NER1
Residue:839
BDBM50385656
NameBDBM50385656
Synonyms:CHEMBL2042264
TypeSmall organic molecule
Emp. Form.C21H27FN2O3S
Mol. Mass.406.514
SMILESCC(C(=O)NCc1ccc(cc1)C(C)(C)C)c1ccc(NS(C)(=O)=O)c(F)c1