Reaction Details
TargetMuscarinic acetylcholine receptor M5
LigandBDBM50385673
Substrate/Competitorn/a
Meas. Tech.ChEMBL_826082 (CHEMBL2045513)
Ki 107.15±n/a nM
Citation Del Bello, FBarocelli, EBertoni, SBonifazi, ACamalli, MCampi, GGiannella, MMatucci, RNesi, MPigini, MQuaglia, WPiergentili, A 1,4-dioxane, a suitable scaffold for the development of novel M3 muscarinic receptor antagonists. J Med Chem55:1783-7 (2012) 
 
Muscarinic acetylcholine receptor M5
Name:Muscarinic acetylcholine receptor M5
Type:PROTEIN
Mol. Mass.:60102.35
Organism:Homo sapiens (Human)
Description:ChEMBL_1517990
Residue:532
BDBM50385673
NameBDBM50385673
Synonyms:CHEMBL2042406
TypeSmall organic molecule
Emp. Form.C20H26NO2
Mol. Mass.312.4254
SMILESC[N+](C)(C)C[C@@H]1COCC(O1)(c1ccccc1)c1ccccc1