Reaction Details
TargetMuscarinic acetylcholine receptor M5
LigandBDBM50385675
Substrate/Competitorn/a
Meas. Tech.ChEMBL_826082 (CHEMBL2045513)
Ki 26302.68±n/a nM
Citation Del Bello, FBarocelli, EBertoni, SBonifazi, ACamalli, MCampi, GGiannella, MMatucci, RNesi, MPigini, MQuaglia, WPiergentili, A 1,4-dioxane, a suitable scaffold for the development of novel M3 muscarinic receptor antagonists. J Med Chem55:1783-7 (2012) 
 
Muscarinic acetylcholine receptor M5
Name:Muscarinic acetylcholine receptor M5
Type:PROTEIN
Mol. Mass.:60102.35
Organism:Homo sapiens (Human)
Description:ChEMBL_1517990
Residue:532
BDBM50385675
NameBDBM50385675
Synonyms:CHEMBL2042400
TypeSmall organic molecule
Emp. Form.C10H22NO2
Mol. Mass.188.2866
SMILESCC[C@H]1COC[C@@H](C[N+](C)(C)C)O1