Reaction Details
TargetMuscarinic acetylcholine receptor M5
LigandBDBM50385682
Substrate/Competitorn/a
Meas. Tech.ChEMBL_826082 (CHEMBL2045513)
Ki 7762.47±n/a nM
Citation Del Bello, FBarocelli, EBertoni, SBonifazi, ACamalli, MCampi, GGiannella, MMatucci, RNesi, MPigini, MQuaglia, WPiergentili, A 1,4-dioxane, a suitable scaffold for the development of novel M3 muscarinic receptor antagonists. J Med Chem55:1783-7 (2012) 
 
Muscarinic acetylcholine receptor M5
Name:Muscarinic acetylcholine receptor M5
Type:PROTEIN
Mol. Mass.:60102.35
Organism:Homo sapiens (Human)
Description:ChEMBL_1517990
Residue:532
BDBM50385682
NameBDBM50385682
Synonyms:CHEMBL390842
TypeSmall organic molecule
Emp. Form.C9H20NO2
Mol. Mass.174.2601
SMILESC[C@H]1COC[C@@H](C[N+](C)(C)C)O1