Reaction Details
TargetMuscarinic acetylcholine receptor M3
LigandBDBM50385676
Substrate/Competitorn/a
Meas. Tech.ChEMBL_826080 (CHEMBL2045511)
Ki 72.44±n/a nM
Citation Del Bello, FBarocelli, EBertoni, SBonifazi, ACamalli, MCampi, GGiannella, MMatucci, RNesi, MPigini, MQuaglia, WPiergentili, A 1,4-dioxane, a suitable scaffold for the development of novel M3 muscarinic receptor antagonists. J Med Chem55:1783-7 (2012) 
 
Muscarinic acetylcholine receptor M3
Name:Muscarinic acetylcholine receptor M3
Type:Enzyme
Mol. Mass.:66151.03
Organism:Homo sapiens (Human)
Description:P20309
Residue:590
BDBM50385676
NameBDBM50385676
Synonyms:CHEMBL2042554
TypeSmall organic molecule
Emp. Form.C19H23NO2
Mol. Mass.297.3914
SMILESCN(C)C[C@@H]1COCC(O1)(c1ccccc1)c1ccccc1