Reaction Details
TargetAldo-keto reductase family 1 member C3
LigandBDBM50385688
Substrate/Competitorn/a
Meas. Tech.ChEMBL_823517 (CHEMBL2046255)
IC50 40±n/a nM
Citation Adeniji, AOTwenter, BMByrns, MCJin, YChen, MWinkler, JDPenning, TM Development of potent and selective inhibitors of aldo-keto reductase 1C3 (type 5 17ß-hydroxysteroid dehydrogenase) based on N-phenyl-aminobenzoates and their structure-activity relationships. J Med Chem55:2311-23 (2012) 
 
Aldo-keto reductase family 1 member C3
Name:Aldo-keto reductase family 1 member C3
Type:Enzyme
Mol. Mass.:36859.86
Organism:Homo sapiens (Human)
Description:P42330
Residue:323
BDBM50385688
NameBDBM50385688
Synonyms:CHEMBL2041556
TypeSmall organic molecule
Emp. Form.C14H12N2O5
Mol. Mass.288.2555
SMILESCOc1ccc(Nc2cccc(c2)C(O)=O)c(c1)[N+]([O-])=O