Reaction Details
TargetProlyl hydroxylase EGLN2
LigandBDBM50385791
Substrate/Competitorn/a
Meas. Tech.ChEMBL_823544 (CHEMBL2045987)
IC50 0.3±n/a nM
Citation Vachal, PMiao, SPierce, JMGuiadeen, DColandrea, VJWyvratt, MJSalowe, SPSonatore, LMMilligan, JAHajdu, RGollapudi, AKeohane, CALingham, RBMandala, SMDeMartino, JATong, XWolff, MSteinhuebel, DKieczykowski, GRFleitz, FJChapman, KAthanasopoulos, JAdam, GAkyuz, CDJena, DKLusen, JWMeng, JStein, BDXia, LSherer, ECHale, JJ 1,3,8-Triazaspiro[4.5]decane-2,4-diones as efficacious pan-inhibitors of hypoxia-inducible factor prolyl hydroxylase 1-3 (HIF PHD1-3) for the treatment of anemia. J Med Chem55:2945-59 (2012) 
 
Prolyl hydroxylase EGLN2
Name:Prolyl hydroxylase EGLN2
Type:Protein
Mol. Mass.:43657.01
Organism:Homo sapiens (Human)
Description:Q96KS0
Residue:407
BDBM50385791
NameBDBM50385791
Synonyms:CHEMBL2041178
TypeSmall organic molecule
Emp. Form.C33H33N7O4
Mol. Mass.591.6596
SMILESCNC(=O)c1ccc(cc1)-c1ccc(cc1)N1C(=O)N(c2cc(OC)ncn2)C2(CCN(Cc3ncccc3C)CC2)C1=O