Reaction Details
TargetProlyl hydroxylase EGLN2
LigandBDBM50385804
Substrate/Competitorn/a
Meas. Tech.ChEMBL_823544 (CHEMBL2045987)
IC50 1±n/a nM
Citation Vachal, PMiao, SPierce, JMGuiadeen, DColandrea, VJWyvratt, MJSalowe, SPSonatore, LMMilligan, JAHajdu, RGollapudi, AKeohane, CALingham, RBMandala, SMDeMartino, JATong, XWolff, MSteinhuebel, DKieczykowski, GRFleitz, FJChapman, KAthanasopoulos, JAdam, GAkyuz, CDJena, DKLusen, JWMeng, JStein, BDXia, LSherer, ECHale, JJ 1,3,8-Triazaspiro[4.5]decane-2,4-diones as efficacious pan-inhibitors of hypoxia-inducible factor prolyl hydroxylase 1-3 (HIF PHD1-3) for the treatment of anemia. J Med Chem55:2945-59 (2012) 
 
Prolyl hydroxylase EGLN2
Name:Prolyl hydroxylase EGLN2
Type:Protein
Mol. Mass.:43657.01
Organism:Homo sapiens (Human)
Description:Q96KS0
Residue:407
BDBM50385804
NameBDBM50385804
Synonyms:CHEMBL2041191
TypeSmall organic molecule
Emp. Form.C31H29N7O4
Mol. Mass.563.6065
SMILESCc1cccnc1CN1CCC2(CC1)N(C(=O)N(C2=O)c1ccc(nc1)-c1ccc(cc1C)C(O)=O)c1cnccn1