Reaction Details
TargetCytochrome P450 2C9
LigandBDBM50385784
Substrate/Competitorn/a
Meas. Tech.ChEMBL_823568 (CHEMBL2046011)
IC50>50000±n/a nM
Citation Vachal, PMiao, SPierce, JMGuiadeen, DColandrea, VJWyvratt, MJSalowe, SPSonatore, LMMilligan, JAHajdu, RGollapudi, AKeohane, CALingham, RBMandala, SMDeMartino, JATong, XWolff, MSteinhuebel, DKieczykowski, GRFleitz, FJChapman, KAthanasopoulos, JAdam, GAkyuz, CDJena, DKLusen, JWMeng, JStein, BDXia, LSherer, ECHale, JJ 1,3,8-Triazaspiro[4.5]decane-2,4-diones as efficacious pan-inhibitors of hypoxia-inducible factor prolyl hydroxylase 1-3 (HIF PHD1-3) for the treatment of anemia. J Med Chem55:2945-59 (2012) 
 
Cytochrome P450 2C9
Name:Cytochrome P450 2C9
Type:Enzyme
Mol. Mass.:55636.33
Organism:Homo sapiens (Human)
Description:P11712
Residue:490
BDBM50385784
NameBDBM50385784
Synonyms:CHEMBL2041171
TypeSmall organic molecule
Emp. Form.C34H32N8O4
Mol. Mass.616.6691
SMILESCOc1cc(ncn1)N1C(=O)N(C(=O)C11CCN(Cc2ncccc2C)CC1)c1ccc(cc1)-c1ccc(cc1)-c1cc(=O)[nH][nH]1