Reaction Details
TargetEgl nine homolog 1
LigandBDBM50385810
Substrate/Competitorn/a
Meas. Tech.ChEMBL_823543 (CHEMBL2045986)
IC50 4.1±n/a nM
Citation Vachal, PMiao, SPierce, JMGuiadeen, DColandrea, VJWyvratt, MJSalowe, SPSonatore, LMMilligan, JAHajdu, RGollapudi, AKeohane, CALingham, RBMandala, SMDeMartino, JATong, XWolff, MSteinhuebel, DKieczykowski, GRFleitz, FJChapman, KAthanasopoulos, JAdam, GAkyuz, CDJena, DKLusen, JWMeng, JStein, BDXia, LSherer, ECHale, JJ 1,3,8-Triazaspiro[4.5]decane-2,4-diones as efficacious pan-inhibitors of hypoxia-inducible factor prolyl hydroxylase 1-3 (HIF PHD1-3) for the treatment of anemia. J Med Chem55:2945-59 (2012) 
 
Egl nine homolog 1
Name:Egl nine homolog 1
Type:Protein
Mol. Mass.:46035.59
Organism:Homo sapiens (Human)
Description:Q9GZT9
Residue:426
BDBM50385810
NameBDBM50385810
Synonyms:CHEMBL2043008
TypeSmall organic molecule
Emp. Form.C30H28N6O3
Mol. Mass.520.5817
SMILESCc1cccnc1CN1CCC2(CC1)N(C(=O)N(C2=O)c1ccc(cc1)-c1ccccc1)c1ccc(=O)[nH]n1