Reaction Details
TargetEgl nine homolog 1
LigandBDBM50385825
Substrate/Competitorn/a
Meas. Tech.ChEMBL_823543 (CHEMBL2045986)
IC50 0.9±n/a nM
Citation Vachal, PMiao, SPierce, JMGuiadeen, DColandrea, VJWyvratt, MJSalowe, SPSonatore, LMMilligan, JAHajdu, RGollapudi, AKeohane, CALingham, RBMandala, SMDeMartino, JATong, XWolff, MSteinhuebel, DKieczykowski, GRFleitz, FJChapman, KAthanasopoulos, JAdam, GAkyuz, CDJena, DKLusen, JWMeng, JStein, BDXia, LSherer, ECHale, JJ 1,3,8-Triazaspiro[4.5]decane-2,4-diones as efficacious pan-inhibitors of hypoxia-inducible factor prolyl hydroxylase 1-3 (HIF PHD1-3) for the treatment of anemia. J Med Chem55:2945-59 (2012) 
 
Egl nine homolog 1
Name:Egl nine homolog 1
Type:Protein
Mol. Mass.:46035.59
Organism:Homo sapiens (Human)
Description:Q9GZT9
Residue:426
BDBM50385825
NameBDBM50385825
Synonyms:CHEMBL2040897
TypeSmall organic molecule
Emp. Form.C29H29N7O3S
Mol. Mass.555.651
SMILESCc1nc(C)c(s1)-c1ccc(cc1)N1C(=O)N(c2cc(=O)[nH]cn2)C2(CCN(Cc3ncccc3C)CC2)C1=O