Reaction Details
TargetSerine/threonine-protein kinase D2
LigandBDBM50385915
Substrate/Competitorn/a
Meas. Tech.ChEMBL_824228 (CHEMBL2044163)
IC50 330±n/a nM
Citation Innocenti, PCheung, KMSolanki, SMas-Droux, CRowan, FYeoh, SBoxall, KWestlake, MPickard, LHardy, TBaxter, JEAherne, GWBayliss, RFry, AMHoelder, S Design of potent and selective hybrid inhibitors of the mitotic kinase Nek2: structure-activity relationship, structural biology, and cellular activity. J Med Chem55:3228-41 (2012) 
 
Serine/threonine-protein kinase D2
Name:Serine/threonine-protein kinase D2
Type:Protein
Mol. Mass.:96755.22
Organism:Homo sapiens (Human)
Description:Q9BZL6
Residue:878
BDBM50385915
NameBDBM50385915
Synonyms:CHEMBL2042135
TypeSmall organic molecule
Emp. Form.C24H25F3N4O2S
Mol. Mass.490.541
SMILESC[C@@H](Oc1cc(ccc1C(N)=O)-c1cc(cnc1N)-c1cc(CN(C)C)cs1)\C=C/C(F)(F)F