Reaction Details
TargetSerine/threonine-protein kinase Nek2
LigandBDBM50385920
Substrate/Competitorn/a
Meas. Tech.ChEMBL_824216 (CHEMBL2044151)
IC50 2680±n/a nM
Citation Innocenti, PCheung, KMSolanki, SMas-Droux, CRowan, FYeoh, SBoxall, KWestlake, MPickard, LHardy, TBaxter, JEAherne, GWBayliss, RFry, AMHoelder, S Design of potent and selective hybrid inhibitors of the mitotic kinase Nek2: structure-activity relationship, structural biology, and cellular activity. J Med Chem55:3228-41 (2012) 
 
Serine/threonine-protein kinase Nek2
Name:Serine/threonine-protein kinase Nek2
Type:Enzyme
Mol. Mass.:51776.96
Organism:Homo sapiens (Human)
Description:P51955
Residue:445
BDBM50385920
NameBDBM50385920
Synonyms:CHEMBL2042033
TypeSmall organic molecule
Emp. Form.C27H26F3N5O2S
Mol. Mass.541.588
SMILESCC(Oc1cc(ccc1C(N)=O)-c1nc(cnc1N)-c1ccc(CN(C)C)s1)c1ccccc1C(F)(F)F