Reaction Details
TargetSerine/threonine-protein kinase Nek2
LigandBDBM50385926
Substrate/Competitorn/a
Meas. Tech.ChEMBL_824216 (CHEMBL2044151)
IC50 2260±n/a nM
Citation Innocenti, PCheung, KMSolanki, SMas-Droux, CRowan, FYeoh, SBoxall, KWestlake, MPickard, LHardy, TBaxter, JEAherne, GWBayliss, RFry, AMHoelder, S Design of potent and selective hybrid inhibitors of the mitotic kinase Nek2: structure-activity relationship, structural biology, and cellular activity. J Med Chem55:3228-41 (2012) 
 
Serine/threonine-protein kinase Nek2
Name:Serine/threonine-protein kinase Nek2
Type:Enzyme
Mol. Mass.:51776.96
Organism:Homo sapiens (Human)
Description:P51955
Residue:445
BDBM50385926
NameBDBM50385926
Synonyms:CHEMBL2042138
TypeSmall organic molecule
Emp. Form.C20H22N4O2S
Mol. Mass.382.479
SMILESCOc1cc(ccc1C(N)=O)-c1cc(cnc1N)-c1cc(CN(C)C)cs1