Reaction Details
TargetAdenosine receptor A2b
LigandBDBM50385955
Substrate/Competitorn/a
Meas. Tech.ChEMBL_824763 (CHEMBL2044690)
EC50 120±n/a nM
Citation Hausler, NEDevine, SMMcRobb, FMWarfe, LPouton, CWHaynes, JMBottle, SEWhite, PJScammells, PJ Synthesis and pharmacological evaluation of dual acting antioxidant A(2A) adenosine receptor agonists. J Med Chem55:3521-34 (2012) 
 
Adenosine receptor A2b
Name:Adenosine receptor A2b
Type:G Protein-Coupled Receptor (GPCR)
Mol. Mass.:36341.22
Organism:Homo sapiens (Human)
Description:n/a
Residue:332
BDBM50385955
NameBDBM50385955
Synonyms:CHEMBL2042311
TypeSmall organic molecule
Emp. Form.C25H25FN6O4
Mol. Mass.492.5022
SMILESCNC(=O)[C@H]1O[C@H]([C@H](O)[C@@H]1O)n1cnc2c(NCC(c3ccccc3)c3ccccc3)nc(F)nc12