Reaction Details
TargetAdenosine receptor A1
LigandBDBM50385945
Substrate/Competitorn/a
Meas. Tech.ChEMBL_824764 (CHEMBL2044691)
IC50 2324±n/a nM
Citation Hausler, NEDevine, SMMcRobb, FMWarfe, LPouton, CWHaynes, JMBottle, SEWhite, PJScammells, PJ Synthesis and pharmacological evaluation of dual acting antioxidant A(2A) adenosine receptor agonists. J Med Chem55:3521-34 (2012) 
 
Adenosine receptor A1
Name:Adenosine receptor A1
Type:G Protein-Coupled Receptor (GPCR)
Mol. Mass.:36520.92
Organism:Homo sapiens (Human)
Description:P30542
Residue:326
BDBM50385945
NameBDBM50385945
Synonyms:CHEMBL2042301
TypeSmall organic molecule
Emp. Form.C35H46N8O5
Mol. Mass.658.7903
SMILESCCNC(=O)[C@H]1O[C@H]([C@H](O)[C@@H]1O)n1cnc2c(N)nc(NCCc3ccc(NC(=O)c4cc(cc(c4)C(C)(C)C)C(C)(C)C)cc3)nc12