Reaction Details
TargetAdenosine receptor A1
LigandBDBM50385950
Substrate/Competitorn/a
Meas. Tech.ChEMBL_824764 (CHEMBL2044691)
IC50 1184±n/a nM
Citation Hausler, NEDevine, SMMcRobb, FMWarfe, LPouton, CWHaynes, JMBottle, SEWhite, PJScammells, PJ Synthesis and pharmacological evaluation of dual acting antioxidant A(2A) adenosine receptor agonists. J Med Chem55:3521-34 (2012) 
 
Adenosine receptor A1
Name:Adenosine receptor A1
Type:G Protein-Coupled Receptor (GPCR)
Mol. Mass.:36520.92
Organism:Homo sapiens (Human)
Description:P30542
Residue:326
BDBM50385950
NameBDBM50385950
Synonyms:CHEMBL2042306
TypeSmall organic molecule
Emp. Form.C34H38N8O4
Mol. Mass.622.7167
SMILESCCNC(=O)[C@H]1O[C@H]([C@H](O)[C@@H]1O)n1cnc2c(NCC(c3ccccc3)c3ccccc3)nc(NCCc3ccc(N)cc3)nc12