Reaction Details
TargetAdenosine receptor A3
LigandBDBM50385949
Substrate/Competitorn/a
Meas. Tech.ChEMBL_824765 (CHEMBL2044692)
IC50 120±n/a nM
Citation Hausler, NEDevine, SMMcRobb, FMWarfe, LPouton, CWHaynes, JMBottle, SEWhite, PJScammells, PJ Synthesis and pharmacological evaluation of dual acting antioxidant A(2A) adenosine receptor agonists. J Med Chem55:3521-34 (2012) 
 
Adenosine receptor A3
Name:Adenosine receptor A3
Type:G Protein-Coupled Receptor (GPCR)
Mol. Mass.:36197.32
Organism:Homo sapiens (Human)
Description:P0DMS8
Residue:318
BDBM50385949
NameBDBM50385949
Synonyms:CHEMBL2042305
TypeSmall organic molecule
Emp. Form.C34H37N7O4
Mol. Mass.607.7021
SMILESCCNC(=O)[C@H]1O[C@H]([C@H](O)[C@@H]1O)n1cnc2c(NCC(c3ccccc3)c3ccccc3)nc(NCCc3ccccc3)nc12