Reaction Details
TargetAdenosine receptor A3
LigandBDBM50385954
Substrate/Competitorn/a
Meas. Tech.ChEMBL_824765 (CHEMBL2044692)
IC50 113±n/a nM
Citation Hausler, NEDevine, SMMcRobb, FMWarfe, LPouton, CWHaynes, JMBottle, SEWhite, PJScammells, PJ Synthesis and pharmacological evaluation of dual acting antioxidant A(2A) adenosine receptor agonists. J Med Chem55:3521-34 (2012) 
 
Adenosine receptor A3
Name:Adenosine receptor A3
Type:G Protein-Coupled Receptor (GPCR)
Mol. Mass.:36197.32
Organism:Homo sapiens (Human)
Description:P0DMS8
Residue:318
BDBM50385954
NameBDBM50385954
Synonyms:CHEMBL2042310
TypeSmall organic molecule
Emp. Form.C42H50N8O5S2
Mol. Mass.811.027
SMILESCCNC(=O)[C@H]1O[C@H]([C@H](O)[C@@H]1O)n1cnc2c(NCC(c3ccccc3)c3ccccc3)nc(NCCc3ccc(NC(=O)CCCC[C@H]4CCSS4)cc3)nc12