Reaction Details
TargetAdenosine receptor A3
LigandBDBM50385956
Substrate/Competitorn/a
Meas. Tech.ChEMBL_824765 (CHEMBL2044692)
IC50 1721±n/a nM
Citation Hausler, NEDevine, SMMcRobb, FMWarfe, LPouton, CWHaynes, JMBottle, SEWhite, PJScammells, PJ Synthesis and pharmacological evaluation of dual acting antioxidant A(2A) adenosine receptor agonists. J Med Chem55:3521-34 (2012) 
 
Adenosine receptor A3
Name:Adenosine receptor A3
Type:G Protein-Coupled Receptor (GPCR)
Mol. Mass.:36197.32
Organism:Homo sapiens (Human)
Description:P0DMS8
Residue:318
BDBM50385956
NameBDBM50385956
Synonyms:CHEMBL2042312
TypeSmall organic molecule
Emp. Form.C48H56N8O6
Mol. Mass.841.0082
SMILESCNC(=O)[C@H]1O[C@H]([C@H](O)[C@@H]1O)n1cnc2c(NCC(c3ccccc3)c3ccccc3)nc(NCCc3ccc(NC(=O)c4cc(c(O)c(c4)C(C)(C)C)C(C)(C)C)cc3)nc12