Reaction Details
TargetAdenosine receptor A2a
LigandBDBM50385947
Substrate/Competitorn/a
Meas. Tech.ChEMBL_824762 (CHEMBL2044689)
EC50 6.6±n/a nM
Citation Hausler, NEDevine, SMMcRobb, FMWarfe, LPouton, CWHaynes, JMBottle, SEWhite, PJScammells, PJ Synthesis and pharmacological evaluation of dual acting antioxidant A(2A) adenosine receptor agonists. J Med Chem55:3521-34 (2012) 
 
Adenosine receptor A2a
Name:Adenosine receptor A2a
Type:G Protein-Coupled Receptor (GPCR)
Mol. Mass.:44716.46
Organism:Homo sapiens (Human)
Description:P29274
Residue:412
BDBM50385947
NameBDBM50385947
Synonyms:CHEMBL2042303
TypeSmall organic molecule
Emp. Form.C28H38N8O5S2
Mol. Mass.630.782
SMILESCCNC(=O)[C@H]1O[C@H]([C@H](O)[C@@H]1O)n1cnc2c(N)nc(NCCc3ccc(NC(=O)CCCC[C@H]4CCSS4)cc3)nc12