Reaction Details
TargetAdenosine receptor A2a
LigandBDBM50385953
Substrate/Competitorn/a
Meas. Tech.ChEMBL_824762 (CHEMBL2044689)
EC50 712±n/a nM
Citation Hausler, NEDevine, SMMcRobb, FMWarfe, LPouton, CWHaynes, JMBottle, SEWhite, PJScammells, PJ Synthesis and pharmacological evaluation of dual acting antioxidant A(2A) adenosine receptor agonists. J Med Chem55:3521-34 (2012) 
 
Adenosine receptor A2a
Name:Adenosine receptor A2a
Type:G Protein-Coupled Receptor (GPCR)
Mol. Mass.:44716.46
Organism:Homo sapiens (Human)
Description:P29274
Residue:412
BDBM50385953
NameBDBM50385953
Synonyms:CHEMBL2042309
TypeSmall organic molecule
Emp. Form.C49H58N8O6
Mol. Mass.855.0348
SMILESCCNC(=O)[C@H]1O[C@H]([C@H](O)[C@@H]1O)n1cnc2c(NCC(c3ccccc3)c3ccccc3)nc(NCCc3ccc(NC(=O)c4cc(c(O)c(c4)C(C)(C)C)C(C)(C)C)cc3)nc12