Reaction Details
TargetAcetylcholinesterase
LigandBDBM50386071
Substrate/Competitorn/a
Meas. Tech.ChEMBL_823696 (CHEMBL2045011)
IC50 361±n/a nM
Citation Meng, FCMao, FShan, WJQin, FHuang, LLi, XS Design, synthesis, and evaluation of indanone derivatives as acetylcholinesterase inhibitors and metal-chelating agents. Bioorg Med Chem Lett22:4462-6 (2012) 
 
Acetylcholinesterase
Name:Acetylcholinesterase
Type:Enzyme
Mol. Mass.:71812.79
Organism:Electrophorus electricus (Electric eel)
Description:n/a
Residue:633
BDBM50386071
NameBDBM50386071
Synonyms:CHEMBL2043051
TypeSmall organic molecule
Emp. Form.C20H29NO3
Mol. Mass.331.4492
SMILESCOc1cc2CCC(=O)c2cc1OCCCCCN1CCCCC1