Reaction Details
TargetAcetylcholinesterase
LigandBDBM50386070
Substrate/Competitorn/a
Meas. Tech.ChEMBL_823696 (CHEMBL2045011)
IC50 1.8±n/a nM
Citation Meng, FCMao, FShan, WJQin, FHuang, LLi, XS Design, synthesis, and evaluation of indanone derivatives as acetylcholinesterase inhibitors and metal-chelating agents. Bioorg Med Chem Lett22:4462-6 (2012) 
 
Acetylcholinesterase
Name:Acetylcholinesterase
Type:Enzyme
Mol. Mass.:71812.79
Organism:Electrophorus electricus (Electric eel)
Description:n/a
Residue:633
BDBM50386070
NameBDBM50386070
Synonyms:CHEMBL2043052
TypeSmall organic molecule
Emp. Form.C23H26N2O3
Mol. Mass.378.4641
SMILESCOc1cc2C\C(=C\c3ccncc3)C(=O)c2cc1OCCN1CCCCC1