Reaction Details
TargetAcetylcholinesterase
LigandBDBM50386056
Substrate/Competitorn/a
Meas. Tech.ChEMBL_823696 (CHEMBL2045011)
IC50 288±n/a nM
Citation Meng, FCMao, FShan, WJQin, FHuang, LLi, XS Design, synthesis, and evaluation of indanone derivatives as acetylcholinesterase inhibitors and metal-chelating agents. Bioorg Med Chem Lett22:4462-6 (2012) 
 
Acetylcholinesterase
Name:Acetylcholinesterase
Type:Enzyme
Mol. Mass.:71812.79
Organism:Electrophorus electricus (Electric eel)
Description:n/a
Residue:633
BDBM50386056
NameBDBM50386056
Synonyms:CHEMBL2043055
TypeSmall organic molecule
Emp. Form.C26H32N2O3
Mol. Mass.420.5439
SMILESCOc1cc2C\C(=C\c3ccncc3)C(=O)c2cc1OCCCCCN1CCCCC1