Reaction Details
TargetChondroitin sulfate N-acetylgalactosaminyltransferase 1
LigandBDBM50386128
Substrate/Competitorn/a
Meas. Tech.ChEMBL_824644 (CHEMBL2045702)
IC50 230000±n/a nM
Citation Jadhav, RDKadam, KSKandre, SGuha, TReddy, MMBrahma, MKDeshmukh, NJDixit, ADoshi, LPotdar, NEnose, AAVishwakarma, RASivaramakrishnan, HSrinivasan, SNemmani, KVGupte, AGangopadhyay, AKSharma, R Synthesis and biological evaluation of isoxazole, oxazole, and oxadiazole containing heteroaryl analogs of biaryl ureas as DGAT1 inhibitors. Eur J Med Chem54:324-42 (2012) 
 
Chondroitin sulfate N-acetylgalactosaminyltransferase 1
Name:Chondroitin sulfate N-acetylgalactosaminyltransferase 1
Type:PROTEIN
Mol. Mass.:61307.78
Organism:Homo sapiens (Human)
Description:ChEMBL_824644
Residue:532
BDBM50386128
NameBDBM50386128
Synonyms:CHEMBL2042216
TypeSmall organic molecule
Emp. Form.C28H25ClN4O6
Mol. Mass.548.974
SMILESCC(C)[C@H](NC(=O)c1ncc(o1)-c1ccc(NC(=O)Nc2ccc(Cl)cc2Oc2ccccc2)cc1)C(O)=O