Reaction Details
TargetChondroitin sulfate N-acetylgalactosaminyltransferase 1
LigandBDBM50386133
Substrate/Competitorn/a
Meas. Tech.ChEMBL_824644 (CHEMBL2045702)
IC50 64000±n/a nM
Citation Jadhav, RDKadam, KSKandre, SGuha, TReddy, MMBrahma, MKDeshmukh, NJDixit, ADoshi, LPotdar, NEnose, AAVishwakarma, RASivaramakrishnan, HSrinivasan, SNemmani, KVGupte, AGangopadhyay, AKSharma, R Synthesis and biological evaluation of isoxazole, oxazole, and oxadiazole containing heteroaryl analogs of biaryl ureas as DGAT1 inhibitors. Eur J Med Chem54:324-42 (2012) 
 
Chondroitin sulfate N-acetylgalactosaminyltransferase 1
Name:Chondroitin sulfate N-acetylgalactosaminyltransferase 1
Type:PROTEIN
Mol. Mass.:61307.78
Organism:Homo sapiens (Human)
Description:ChEMBL_824644
Residue:532
BDBM50386133
NameBDBM50386133
Synonyms:CHEMBL2042334
TypeSmall organic molecule
Emp. Form.C23H24N4O6
Mol. Mass.452.4599
SMILESCOc1ccc(NC(=O)Nc2ccc(cc2)-c2cc(on2)C(=O)N[C@@H](C(C)C)C(O)=O)cc1